{"text_format":"1","workbook":"xlsx","n_sheets":5,"sheets":["印刷シート","基本シート","特技シート","自動計算領域","バージョン情報"],"not_rendered":{"charts":0,"images":0,"macros":1,"external_links":0,"defined_names":9,"comments":2,"pivot_tables":0},"unopened":[],"bounds":{"document_bytes":16777216,"sheet_cells":100000,"rows_first":2000,"rows_last":500,"rows_between":2000,"halvings":0,"cell_chars":16384,"cell_head_chars":4096},"cells_cut":0,"cells_raw":0,"read":"whole","date_system":"1900"}

{"sheet":"印刷シート","index":0,"n_rows":95,"n_cols":77,"rows_kept":95,"cut":false,"hidden":false,"merged":[[90,58,92,63],[90,64,92,65],[38,60,40,63],[38,64,40,66],[54,53,55,54],[54,55,55,56],[60,57,61,58],[60,59,61,60],[62,59,63,60],[62,63,63,64],[62,65,63,66],[66,65,67,66],[68,57,69,58],[68,59,69,60],[68,61,69,62],[68,63,69,64],[90,66,92,67],[90,68,92,73],[93,49,95,50],[93,51,95,56],[93,58,95,63],[93,64,95,65],[93,66,95,67],[93,68,95,73],[72,41,73,43],[87,58,89,63],[87,64,89,65],[87,66,89,67],[87,68,89,73],[74,69,75,70],[74,49,75,50],[74,51,75,52],[74,53,75,54],[74,55,75,56],[76,55,77,56],[76,57,77,58],[76,59,77,60],[76,61,77,62],[76,63,77,64],[74,61,75,62],[72,75,73,79],[74,41,75,43],[74,75,75,79],[76,41,77,43],[76,75,77,79],[72,57,73,58],[72,59,73,60],[72,73,73,74],[72,44,73,48],[72,65,73,66],[72,71,73,72],[72,49,73,50],[72,51,73,52],[72,53,73,54],[72,55,73,56],[72,67,73,68],[72,69,73,70],[72,61,73,62],[72,63,73,64],[74,65,75,66],[74,71,75,72],[74,73,75,74],[74,44,75,48],[74,67,75,68],[38,45,40,47],[38,54,40,56],[60,75,61,79],[62,75,63,79],[64,75,65,79],[66,75,67,79],[68,75,69,79],[70,75,71,79],[23,76,25,79],[29,76,31,79],[35,76,37,79],[41,76,43,79],[32,48,34,56],[50,63,51,64],[50,51,51,52],[50,53,51,54],[50,55,51,56],[50,57,51,58],[50,59,51,60],[50,61,51,62],[54,75,55,79],[56,75,57,79],[58,75,59,79],[23,51,25,53],[26,48,28,50],[26,51,28,53],[38,48,40,50],[38,51,40,53],[41,70,43,72],[41,73,43,75],[38,70,40,72],[38,73,40,75],[38,76,40,79],[41,67,43,69],[35,57,37,59],[35,60,37,63],[35,64,37,66],[35,67,37,69],[35,48,37,56],[0,76,10,79],[11,76,13,79],[14,76,16,79],[17,76,19,79],[20,76,22,79],[14,48,16,50],[14,51,16,53],[17,48,19,50],[17,51,19,53],[20,48,22,50],[20,51,22,53],[2,64,10,66],[0,67,1,69],[0,70,1,72],[2,67,10,69],[2,70,10,72],[0,73,1,75],[2,73,10,75],[11,70,13,72],[11,73,13,75],[14,73,16,75],[14,54,16,56],[14,57,16,59],[14,60,16,63],[0,45,10,47],[0,48,1,53],[0,54,10,56],[0,57,10,59],[0,60,10,63],[2,51,10,53],[2,48,10,50],[0,64,1,66],[66,41,67,43],[41,45,43,47],[41,54,43,56],[47,49,49,50],[58,41,59,43],[56,49,57,50],[56,51,57,52],[41,48,43,50],[41,51,43,53],[50,49,51,50],[60,41,61,43],[62,41,63,43],[64,41,65,43],[41,57,43,59],[41,60,43,63],[41,64,43,66],[32,76,34,79],[52,41,53,43],[54,41,55,43],[56,41,57,43],[47,69,49,70],[35,70,37,72],[35,73,37,75],[38,57,40,59],[47,67,49,68],[35,45,37,47],[50,41,51,43],[45,41,46,44],[52,63,53,64],[52,65,53,66],[52,71,53,72],[54,65,55,66],[54,71,55,72],[54,73,55,74],[54,44,55,48],[52,67,53,68],[52,69,53,70],[54,49,55,50],[54,51,55,52],[52,75,53,79],[26,70,28,72],[26,60,28,63],[26,64,28,66],[26,67,28,69],[29,67,31,69],[26,73,28,75],[23,48,25,50],[26,76,28,79],[50,75,51,79],[29,70,31,72],[29,73,31,75],[32,57,34,59],[32,60,34,63],[32,64,34,66],[32,67,34,69],[32,70,34,72],[29,54,31,56],[32,73,34,75],[29,57,31,59],[29,60,31,63],[29,64,31,66],[29,48,31,50],[29,51,31,53],[38,67,40,69],[20,73,22,75],[17,54,19,56],[17,57,19,59],[23,54,25,56],[23,57,25,59],[23,60,25,63],[23,64,25,66],[23,67,25,69],[23,70,25,72],[23,73,25,75],[20,54,22,56],[20,57,22,59],[20,60,22,63],[20,64,22,66],[20,67,22,69],[20,70,22,72],[17,60,19,63],[17,64,19,66],[17,67,19,69],[17,70,19,72],[17,73,19,75],[11,41,13,44],[14,41,16,44],[17,41,19,44],[20,41,22,44],[23,41,25,44],[14,64,16,66],[14,67,16,69],[14,70,16,72],[11,54,13,56],[11,57,13,59],[11,60,13,63],[11,64,13,66],[11,67,13,69],[11,48,13,50],[11,51,13,53],[11,45,13,47],[14,45,16,47],[17,45,19,47],[20,45,22,47],[23,45,25,47],[84,58,86,63],[84,64,86,65],[84,66,86,67],[84,68,86,73],[84,41,86,46],[84,47,86,48],[84,49,86,50],[84,51,86,56],[81,66,83,67],[81,68,83,73],[52,73,53,74],[52,44,53,48],[52,49,53,50],[52,51,53,52],[52,53,53,54],[52,55,53,56],[52,57,53,58],[52,59,53,60],[52,61,53,62],[87,47,89,48],[87,49,89,50],[87,51,89,56],[90,41,92,46],[90,47,92,48],[90,49,92,50],[90,51,92,56],[93,41,95,46],[93,47,95,48],[94,0,95,2],[54,20,56,23],[57,20,59,23],[60,20,62,23],[63,20,65,23],[66,20,68,23],[69,20,71,23],[72,20,74,23],[75,20,77,23],[78,20,80,23],[75,14,77,15],[75,16,77,17],[75,18,77,19],[60,18,62,19],[54,18,56,19],[94,3,95,35],[90,15,91,23],[92,3,93,11],[92,12,93,14],[92,15,93,23],[90,24,91,26],[90,27,91,35],[92,24,93,26],[92,27,93,35],[78,0,80,5],[78,6,80,7],[78,8,80,11],[78,12,80,13],[78,14,80,15],[78,16,80,17],[72,18,74,19],[72,24,74,38],[75,0,77,5],[75,6,77,7],[75,8,77,11],[75,12,77,13],[88,0,89,5],[87,41,89,46],[90,0,91,2],[92,0,93,2],[81,20,83,23],[84,20,86,23],[90,3,91,11],[90,12,91,14],[84,18,86,19],[84,24,86,38],[0,0,12,25],[0,27,26,38],[42,20,44,23],[45,20,47,23],[48,20,50,23],[51,20,53,23],[14,0,16,5],[14,6,16,16],[84,0,86,5],[84,6,86,7],[84,8,86,11],[84,12,86,13],[84,14,86,15],[84,16,86,17],[78,18,80,19],[78,24,80,38],[81,0,83,5],[81,6,83,7],[81,8,83,11],[81,12,83,13],[81,14,83,15],[81,16,83,17],[81,18,83,19],[81,24,83,38],[72,0,74,5],[72,6,74,7],[72,8,74,11],[72,12,74,13],[72,14,74,15],[72,16,74,17],[66,18,68,19],[66,24,68,38],[69,0,71,5],[69,6,71,7],[69,8,71,11],[69,12,71,13],[69,14,71,15],[69,16,71,17],[69,18,71,19],[69,24,71,38],[66,0,68,5],[66,6,68,7],[66,8,68,11],[66,12,68,13],[66,14,68,15],[66,16,68,17],[63,0,65,5],[63,6,65,7],[63,8,65,11],[63,12,65,13],[63,14,65,15],[63,16,65,17],[63,18,65,19],[63,24,65,38],[60,0,62,5],[60,6,62,7],[60,8,62,11],[60,12,62,13],[60,14,62,15],[60,16,62,17],[57,0,59,5],[57,6,59,7],[57,8,59,11],[57,12,59,13],[57,14,59,15],[57,16,59,17],[57,18,59,19],[57,24,59,38],[54,0,56,5],[54,6,56,7],[54,8,56,11],[54,12,56,13],[54,14,56,15],[54,16,56,17],[51,0,53,5],[51,6,53,7],[51,8,53,11],[51,12,53,13],[51,14,53,15],[51,16,53,17],[51,18,53,19],[51,24,53,38],[54,24,56,38],[45,16,47,17],[45,18,47,19],[45,24,47,38],[48,0,50,5],[48,6,50,7],[48,8,50,11],[48,12,50,13],[48,14,50,15],[48,16,50,17],[48,18,50,19],[48,24,50,38],[42,12,44,13],[45,0,47,5],[45,6,47,7],[45,8,47,11],[45,12,47,13],[45,14,47,15],[0,41,10,44],[34,35,35,38],[36,35,37,38],[42,0,44,5],[42,6,44,7],[42,8,44,11],[42,24,44,38],[42,18,44,19],[42,16,44,17],[42,14,44,15],[30,0,35,3],[36,23,37,26],[36,27,37,30],[34,23,35,26],[34,27,35,30],[34,31,35,34],[36,31,37,34],[30,19,31,21],[30,4,31,6],[30,7,31,9],[30,10,31,12],[32,10,35,12],[30,13,31,15],[30,16,31,18],[38,0,39,2],[40,0,41,5],[40,6,41,7],[40,8,41,11],[40,12,41,13],[40,14,41,15],[40,16,41,17],[32,7,35,9],[32,4,35,6],[32,16,35,18],[40,18,41,19],[32,13,35,15],[22,0,24,5],[22,6,24,16],[26,0,28,2],[26,10,28,13],[26,3,28,8],[26,14,28,16],[14,18,16,19],[17,18,19,19],[14,20,16,21],[17,20,19,21],[17,0,19,5],[17,6,19,16],[14,23,15,25],[16,23,18,25],[26,18,28,20],[23,18,25,20],[28,23,29,26],[50,65,51,66],[50,71,51,72],[50,73,51,74],[50,44,51,48],[50,67,51,68],[50,69,51,70],[32,19,35,21],[40,20,41,23],[30,23,31,26],[28,27,29,36],[30,27,31,36],[32,27,33,36],[40,24,41,38],[32,23,33,26],[26,41,28,44],[29,41,31,44],[32,41,34,44],[35,41,37,44],[38,41,40,44],[54,67,55,68],[54,69,55,70],[56,53,57,54],[56,55,57,56],[56,57,57,58],[56,59,57,60],[54,61,55,62],[54,63,55,64],[56,61,57,62],[56,63,57,64],[54,57,55,58],[54,59,55,60],[56,65,57,66],[56,71,57,72],[56,73,57,74],[56,44,57,48],[58,73,59,74],[58,44,59,48],[56,67,57,68],[56,69,57,70],[58,49,59,50],[58,51,59,52],[58,53,59,54],[58,55,59,56],[58,57,59,58],[58,59,59,60],[60,73,61,74],[60,44,61,48],[58,67,59,68],[58,69,59,70],[60,49,61,50],[60,51,61,52],[60,53,61,54],[60,55,61,56],[60,67,61,68],[60,69,61,70],[58,61,59,62],[58,63,59,64],[58,65,59,66],[58,71,59,72],[60,65,61,66],[60,71,61,72],[60,61,61,62],[60,63,61,64],[62,71,63,72],[62,73,63,74],[62,44,63,48],[62,49,63,50],[62,51,63,52],[62,53,63,54],[62,55,63,56],[62,57,63,58],[64,44,65,48],[62,67,63,68],[62,69,63,70],[64,49,65,50],[64,51,65,52],[64,53,65,54],[64,55,65,56],[64,57,65,58],[64,59,65,60],[62,61,63,62],[64,71,65,72],[66,71,67,72],[66,61,67,62],[66,63,67,64],[64,73,65,74],[66,67,67,68],[66,69,67,70],[66,73,67,74],[64,63,65,64],[64,65,65,66],[64,67,65,68],[64,69,65,70],[66,49,67,50],[66,51,67,52],[66,53,67,54],[66,55,67,56],[66,57,67,58],[66,59,67,60],[64,61,65,62],[68,71,69,72],[68,73,69,74],[68,44,69,48],[68,49,69,50],[68,51,69,52],[68,53,69,54],[68,55,69,56],[70,73,71,74],[70,44,71,48],[68,67,69,68],[68,69,69,70],[70,49,71,50],[70,51,71,52],[70,53,71,54],[70,55,71,56],[70,57,71,58],[70,59,71,60],[70,61,71,62],[70,63,71,64],[70,65,71,66],[70,71,71,72],[70,67,71,68],[70,69,71,70],[68,65,69,66],[47,75,49,79],[47,41,49,43],[47,63,49,64],[47,61,49,62],[47,59,49,60],[47,57,49,58],[47,73,49,74],[47,71,49,72],[47,44,49,48],[47,55,49,56],[76,71,77,72],[76,73,77,74],[76,44,77,48],[76,67,77,68],[76,69,77,70],[76,49,77,50],[76,51,77,52],[76,53,77,54],[74,63,75,64],[74,57,75,58],[74,59,75,60],[81,64,83,65],[20,22,22,25],[81,41,83,46],[81,47,83,48],[81,49,83,50],[81,51,83,56],[81,58,83,63],[47,53,49,54],[47,51,49,52],[47,65,49,66],[79,41,80,44],[76,65,77,66],[66,44,67,48],[23,22,26,25],[60,24,62,38],[75,24,77,38],[41,41,43,44],[26,45,28,47],[26,54,28,56],[26,57,28,59],[32,45,34,47],[29,45,31,47],[68,41,69,43],[70,41,71,43]]}
["Nightwizard 3rd\nオリジナルキャラクターシート\nver.1.05",null,null,null,null,null,null,null,null,null,null,null,null,null,null,null,null,null,null,null,null,null,null,null,null,null,null,null,null,null,null,null,null,null,null,null,null,null,null,null,null,"戦闘能力値",null,null,null,"ベース",null,null,"クラス",null,null,null,null,null,"レベル",null,null,"特技等",null,null,"未装備",null,null,null,"武器",null,null,"魔装",null,null,"防具",null,null,"その他",null,null,"合計"]
[]
[null,null,null,null,null,null,null,null,null,null,null,null,null,null,null,null,null,null,null,null,null,null,null,null,null,null,null,null,null,null,null,null,null,null,null,null,null,null,null,null,null,null,null,null,null,null,null,null,{"$f":"基本シート!E3","v":"錬金術師"},null,null,{"$f":"基本シート!E4","v":"魔物使い"},null,null,null,null,null,null,null,null,null,null,null,null,{"$f":"基本シート!C32","v":"エメスブルーム（魔物）"},null,null,{"$f":"基本シート!C34","v":0},null,null,{"$f":"IF(基本シート!C38>0,基本シート!C38&\"等\",0)","v":"改造服等"},null,null,{"$f":"IF(基本シート!C42>0,基本シート!C42&\"等\",0)","v":0}]
[]
[]
[]
[]
[]
[]
[]
[]
[null,null,null,null,null,null,null,null,null,null,null,null,null,null,null,null,null,null,null,null,null,null,null,null,null,null,null,null,null,null,null,null,null,null,null,null,null,null,null,null,null,"命中",null,null,null,{"$f":"基本シート!C12","v":8},null,null,{"$f":"基本シート!D12","v":1},null,null,{"$f":"基本シート!E12","v":1},null,null,{"$f":"基本シート!F12","v":0},null,null,{"$f":"基本シート!G12","v":0},null,null,{"$f":"基本シート!I12","v":10},null,null,null,{"$f":"基本シート!J12","v":3},null,null,{"$f":"基本シート!K12","v":0},null,null,{"$f":"基本シート!L12","v":0},null,null,{"$f":"基本シート!M12","v":0},null,null,{"$f":"基本シート!N12","v":13}]
[]
[]
["キャラクター名",null,null,null,null,null,"紗夜・モンモランシ＝ラヴァル",null,null,null,null,null,null,null,null,null,null,null,"年齢",null,20,null,null,"経験点",null,null,null,null,null,null,null,null,null,null,null,null,null,null,null,null,null,"回避",null,null,null,{"$f":"基本シート!C13","v":6},null,null,{"$f":"基本シート!D13","v":0},null,null,{"$f":"基本シート!E13","v":1},null,null,{"$f":"基本シート!F13","v":0},null,null,{"$f":"基本シート!G13","v":0},null,null,{"$f":"基本シート!I13","v":7},null,null,null,{"$f":"基本シート!J13","v":-1},null,null,{"$f":"基本シート!K13","v":0},null,null,{"$f":"基本シート!L13","v":0},null,null,{"$f":"基本シート!M13","v":0},null,null,{"$f":"基本シート!N13","v":6}]
{"$rows_left_out":81}
{"sheet":"基本シート","index":1,"n_rows":61,"n_cols":27,"rows_kept":61,"cut":false,"hidden":false,"merged":[[1,1,1,3],[2,4,2,6],[2,1,3,3],[20,20,20,21],[5,8,5,9],[10,3,10,4],[10,6,10,7],[13,6,13,7],[3,4,3,6],[1,4,1,6],[10,20,10,21],[12,6,12,7],[11,17,14,17],[6,20,6,21],[7,20,7,21],[8,20,8,21],[9,20,9,21],[14,6,14,7],[11,6,11,7],[1,8,1,10],[2,8,2,10],[1,20,1,21],[10,15,10,16],[9,22,9,23],[10,22,10,23],[14,22,14,23],[4,20,4,21],[5,20,5,21],[21,20,21,21],[21,22,21,23],[17,6,17,7],[18,6,18,7],[19,6,19,7],[20,6,20,7],[19,20,19,21],[19,22,19,23],[15,17,18,17],[18,20,18,21],[16,6,16,7],[17,20,17,21],[15,16,18,16],[16,20,16,21],[15,6,15,7],[11,16,14,16],[14,2,17,2],[21,6,21,7],[11,20,11,21],[11,22,11,23],[12,20,12,21],[12,22,12,23],[13,20,13,21],[13,22,13,23],[15,20,15,21],[17,22,17,23],[19,3,19,5],[18,3,18,5],[3,20,3,23],[30,2,30,4],[30,20,30,22],[31,2,31,4],[31,20,31,22],[32,2,32,4],[32,20,32,22],[30,18,30,19],[31,18,31,19],[32,18,32,19],[15,22,15,23],[22,20,22,21],[22,22,22,23],[23,20,23,21],[23,22,23,23],[18,22,18,23],[16,22,16,23],[20,22,20,23],[4,22,4,23],[5,22,5,23],[6,22,6,23],[7,22,7,23],[8,22,8,23],[14,20,14,21],[37,18,37,19],[38,18,38,19],[33,2,33,4],[33,20,33,22],[34,2,34,4],[34,20,34,22],[35,2,35,4],[35,20,35,22],[36,2,36,4],[36,20,36,22],[37,2,37,4],[37,20,37,22],[38,2,38,4],[33,18,33,19],[34,18,34,19],[35,18,35,19],[1,12,1,13],[2,12,2,13],[60,1,60,5],[52,2,52,3],[51,2,51,3],[53,2,53,3],[54,2,54,3],[46,2,46,4],[24,10,24,11],[55,2,55,3],[56,2,56,3],[57,2,57,3],[58,2,58,3],[59,2,59,3],[48,1,48,2],[51,8,51,10],[52,8,52,10],[53,8,53,10],[54,8,54,10],[55,8,55,10],[56,8,56,10],[57,13,57,15],[58,13,58,15],[44,2,44,4],[59,13,59,15],[60,8,60,10],[52,13,52,15],[53,13,53,15],[54,13,54,15],[57,8,57,10],[58,8,58,10],[59,8,59,10],[45,2,45,4],[48,5,48,6],[45,18,45,19],[45,20,45,22],[27,10,27,11],[44,18,44,19],[46,18,46,19],[46,20,46,22],[41,2,41,4],[42,2,42,4],[43,2,43,4],[44,20,44,22],[39,18,39,19],[40,18,40,19],[41,18,41,19],[42,18,42,19],[43,18,43,19],[41,20,41,22],[42,20,42,22],[43,20,43,22],[39,2,39,4],[39,20,39,22],[40,2,40,4],[40,20,40,22],[38,20,38,22],[36,18,36,19]]}
[]
[null,null,null,null,"クラス名",null,null,null,"キャラクターレベル",null,null,null,"消費経験点",null,null,null,null,null,null,null,"出身世界",null,8,null,null,"パスワード"]
[null,"現在クラス",null,null,{"$f":"IF(ISERROR(VLOOKUP(I3,履歴,2,0)),\"\",VLOOKUP(I3,履歴,2,0))","v":"錬金術師"},null,null,null,1,null,null,null,{"$f":"特技シート!B44+IF((S47-500000)<=0,0,(S47-500000)/200000)","v":10},null,null,null,null,null,null,null,null,null,null,null,null,"NW3基本",122251]
[null,null,null,null,{"$f":"IF(ISERROR(VLOOKUP(I3,履歴,4,0)),\"\",VLOOKUP(I3,履歴,4,0))","v":"魔物使い"},null,null,null,null,null,null,null,null,null,null,null,null,null,null,"レベル","クラス履歴",null,null,null,null,"NW3上級","Iris118"]
[null,null,null,null,null,null,null,null,null,null,null,null,null,null,null,null,null,null,null,1,"錬金術師",null,"魔物使い"]
[null,"属性","火","地",null,null,null,null,"初期選択",null,"筋力",null,null,null,null,null,null,null,null,2]
[null,"筋力","器用","感覚","理知","意思","幸運",null,null,null,null,null,null,null,null,null,null,null,null,3]
[null,{"$f":"IF(ISERROR(自動計算領域!N7),\"\",自動計算領域!N7)","v":9},{"$f":"IF(ISERROR(自動計算領域!O7),\"\",自動計算領域!O7)","v":7},{"$f":"IF(ISERROR(自動計算領域!P7),\"\",自動計算領域!P7)","v":5},{"$f":"IF(ISERROR(自動計算領域!Q7),\"\",自動計算領域!Q7)","v":8},{"$f":"IF(ISERROR(自動計算領域!R7),\"\",自動計算領域!R7)","v":8},{"$f":"IF(ISERROR(自動計算領域!S7),\"\",自動計算領域!S7)","v":6},null,null,null,null,null,null,null,null,null,null,null,null,4]
[null,null,null,null,null,null,null,null,null,null,null,null,null,null,null,null,null,null,null,5]
[null,null,null,null,null,null,null,null,null,null,null,null,null,null,null,null,null,null,null,6]
[null,null,"ベース","クラス修正",null,"レベル","特技、その他",null,"未装備","武器","魔装","防具","その他","合計",null,"CLボーナス",null,"上限",null,7]
[null,"命中",{"$f":"INT(SUM(B8:C8)/2)","v":8},{"$f":"IF(ISERROR(VLOOKUP(E3,クラス修正,2,0)),\"\",VLOOKUP(E3,クラス修正,2,0))","v":1},{"$f":"IF(ISERROR(VLOOKUP(E4,クラス修正,2,0)),\"\",VLOOKUP(E4,クラス修正,2,0))","v":1},null,null,null,{"$f":"SUM(C12:H12)","v":10},{"$f":"SUM(H32:H33)","v":3},{"$f":"SUM(H34:H35)","v":0},{"$f":"SUM(H36:H40)","v":0},{"$f":"SUM(H41:H45)","v":0},{"$f":"SUM(I12:M12)","v":13},null,"命中",{"$f":"IF(I3=1,0,INT(I3/2))","v":0},{"$f":"IF(I3=1,0,ROUNDUP(I3/3,0))","v":0},null,8]
[null,"回避",{"$f":"INT(SUM(C8:D8)/2)","v":6},{"$f":"IF(ISERROR(VLOOKUP(E3,クラス修正,3,0)),\"\",VLOOKUP(E3,クラス修正,3,0))","v":0},{"$f":"IF(ISERROR(VLOOKUP(E4,クラス修正,3,0)),\"\",VLOOKUP(E4,クラス修正,3,0))","v":1},null,null,null,7,{"$f":"SUM(I32:I33)","v":-1},{"$f":"SUM(I34:I35)","v":0},{"$f":"SUM(I36:I40)","v":0},{"$f":"SUM(I41:I45)","v":0},6,null,"回避",null,null,null,9]
[null,"魔導",{"$f":"INT(SUM(E8:F8)/2)","v":8},{"$f":"IF(ISERROR(VLOOKUP(E3,クラス修正,4,0)),\"\",VLOOKUP(E3,クラス修正,4,0))","v":1},{"$f":"IF(ISERROR(VLOOKUP(E4,クラス修正,4,0)),\"\",VLOOKUP(E4,クラス修正,4,0))","v":0},null,null,null,9,{"$f":"SUM(J32:J33)","v":1},{"$f":"SUM(J34:J35)","v":0},{"$f":"SUM(J36:J40)","v":0},{"$f":"SUM(J41:J45)","v":0},10,null,"魔導",null,null,null,10]
[null,"物攻",null,{"$f":"IF(ISERROR(VLOOKUP(E3,クラス修正,5,0)),\"\",VLOOKUP(E3,クラス修正,5,0))","v":1},{"$f":"IF(ISERROR(VLOOKUP(E4,クラス修正,5,0)),\"\",VLOOKUP(E4,クラス修正,5,0))","v":1},null,null,null,2,{"$f":"IF(D49=\"Yes\",SUM(K32:K33),K32)","v":17},{"$f":"SUM(K34:K35)","v":0},{"$f":"SUM(K36:K40)","v":0},{"$f":"SUM(K41:K45)","v":0},19,null,"行動",null,null,null,11]
{"$rows_left_out":47}
{"sheet":"特技シート","index":2,"n_rows":48,"n_cols":12,"rows_kept":48,"cut":false,"hidden":false,"merged":[]}
[null,null,"特殊能力名","SL","タイミング","判定","対象","射程","代償","使用条件","効果","参照P"]
[null,null,{"$f":"IF(ISERROR(VLOOKUP(基本シート!$W$2,自動計算領域!$A$3:$K$10,2,0)),\"\",VLOOKUP(基本シート!$W$2,自動計算領域!$A$3:$K$10,2,0))","v":"月衣"},{"$f":"IF(ISERROR(VLOOKUP(基本シート!$W$2,自動計算領域!$A$3:$K$10,3,0)),\"\",VLOOKUP(基本シート!$W$2,自動計算領域!$A$3:$K$10,3,0))","v":"-"},{"$f":"IF(ISERROR(VLOOKUP(基本シート!$W$2,自動計算領域!$A$3:$K$10,4,0)),\"\",VLOOKUP(基本シート!$W$2,自動計算領域!$A$3:$K$10,4,0))","v":"常時"},{"$f":"IF(ISERROR(VLOOKUP(基本シート!$W$2,自動計算領域!$A$3:$K$10,5,0)),\"\",VLOOKUP(基本シート!$W$2,自動計算領域!$A$3:$K$10,5,0))","v":"自動"},{"$f":"IF(ISERROR(VLOOKUP(基本シート!$W$2,自動計算領域!$A$3:$K$10,6,0)),\"\",VLOOKUP(基本シート!$W$2,自動計算領域!$A$3:$K$10,6,0))","v":"自身"},{"$f":"IF(ISERROR(VLOOKUP(基本シート!$W$2,自動計算領域!$A$3:$K$10,7,0)),\"\",VLOOKUP(基本シート!$W$2,自動計算領域!$A$3:$K$10,7,0))","v":"なし"},{"$f":"IF(ISERROR(VLOOKUP(基本シート!$W$2,自動計算領域!$A$3:$K$10,8,0)),\"\",VLOOKUP(基本シート!$W$2,自動計算領域!$A$3:$K$10,8,0))","v":"なし"},{"$f":"IF(ISERROR(VLOOKUP(基本シート!$W$2,自動計算領域!$A$3:$K$10,9,0)),\"\",VLOOKUP(基本シート!$W$2,自動計算領域!$A$3:$K$10,9,0))","v":"なし"},{"$f":"IF(ISERROR(VLOOKUP(基本シート!$W$2,自動計算領域!$A$3:$K$10,10,0)),\"\",VLOOKUP(基本シート!$W$2,自動計算領域!$A$3:$K$10,10,0))","v":"アイテムを隠す"}]
[null,null,{"$f":"IF(ISERROR(VLOOKUP(基本シート!$W$2,自動計算領域!$A$11:$K$18,2,0)),\"\",VLOOKUP(基本シート!$W$2,自動計算領域!$A$11:$K$18,2,0))","v":"月匣"},{"$f":"IF(ISERROR(VLOOKUP(基本シート!$W$2,自動計算領域!$A$11:$K$18,3,0)),\"\",VLOOKUP(基本シート!$W$2,自動計算領域!$A$11:$K$18,3,0))","v":"-"},{"$f":"IF(ISERROR(VLOOKUP(基本シート!$W$2,自動計算領域!$A$11:$K$18,4,0)),\"\",VLOOKUP(基本シート!$W$2,自動計算領域!$A$11:$K$18,4,0))","v":"常時"},{"$f":"IF(ISERROR(VLOOKUP(基本シート!$W$2,自動計算領域!$A$11:$K$18,5,0)),\"\",VLOOKUP(基本シート!$W$2,自動計算領域!$A$11:$K$18,5,0))","v":"自動"},{"$f":"IF(ISERROR(VLOOKUP(基本シート!$W$2,自動計算領域!$A$11:$K$18,6,0)),\"\",VLOOKUP(基本シート!$W$2,自動計算領域!$A$11:$K$18,6,0))","v":"自身"},{"$f":"IF(ISERROR(VLOOKUP(基本シート!$W$2,自動計算領域!$A$11:$K$18,7,0)),\"\",VLOOKUP(基本シート!$W$2,自動計算領域!$A$11:$K$18,7,0))","v":"なし"},{"$f":"IF(ISERROR(VLOOKUP(基本シート!$W$2,自動計算領域!$A$11:$K$18,8,0)),\"\",VLOOKUP(基本シート!$W$2,自動計算領域!$A$11:$K$18,8,0))","v":"なし"},{"$f":"IF(ISERROR(VLOOKUP(基本シート!$W$2,自動計算領域!$A$11:$K$18,9,0)),\"\",VLOOKUP(基本シート!$W$2,自動計算領域!$A$11:$K$18,9,0))","v":"なし"},{"$f":"IF(ISERROR(VLOOKUP(基本シート!$W$2,自動計算領域!$A$11:$K$18,10,0)),\"\",VLOOKUP(基本シート!$W$2,自動計算領域!$A$11:$K$18,10,0))","v":"月匣を展開"}]
["クラス",{"$f":"IF(ISERROR(IF(A4=\"クラス\",0,D4*5)),0,IF(A4=\"クラス\",0,D4*5))","v":0},"魔物契約",1,"常時","なし","自身","なし","なし","なし","魔物装備を得る（エメスブルーム命中+2）","48P"]
["クラス",{"$f":"IF(ISERROR(IF(A5=\"クラス\",0,D5*5)),0,IF(A5=\"クラス\",0,D5*5))","v":0},"アルケミカルナレッジ",1,"セットアップ","なし","自身","なし","5MP","なし","ボーションを強化する","58P"]
["クラス",0,"ワンダーガジェット",1,"常時","なし","自身","なし","なし","なし","分類：錬金の箒をひとつ得る"]
["クラス",0,"ブルームウォール",1,"ダメージロール","自動","単体","近","7MP","錬金","装備している箒の[重量]だけダメージ軽減","58P"]
["クラス",0,"高出力ブルーム",1,"常時","なし","自身","なし","なし","なし","命中+1、「物攻」or「魔攻」+[SLx2]","59P"]
["クラス",0,"魔物進化",1,"常時","なし","自身","なし","なし","なし","命中+2、「物攻」＋「slx2」","49P"]
["一般",10,"イクイップリミット",2,"常時","なし","自身","なし","なし","なし","重量上限+[SLx2]","110P"]
[null,0]
[null,0]
[null,0]
[null,0]
[null,0]
{"$rows_left_out":34}
{"sheet":"自動計算領域","index":3,"n_rows":32,"n_cols":57,"rows_kept":32,"cut":false,"hidden":false,"merged":[]}
[null,null,null,null,null,null,null,null,null,null,null,null,null,"筋力","器用","感覚","理知","意思","幸運","耐久力","魔法力",null,"属性","筋力","器用","感覚","理知","意思","幸運","耐久力","魔法力",null,"クラス","筋力","器用","感覚","理知","意思","幸運",null,"クラス","命中","回避","魔導","物攻","魔攻","物防","魔防","耐久力","魔法力","行動値",null,"クラス選択用",null,null,"パス確認","パス本体"]
[null,"特殊能力名","ﾚﾍﾞﾙ","タイミング","判定値","対象","射程","代償","使用条件","効果","参照P",null,{"$f":"基本シート!U5","v":"錬金術師"},{"$f":"VLOOKUP($M2,クラス能力値,2,0)","v":2},{"$f":"VLOOKUP($M2,クラス能力値,3,0)","v":3},{"$f":"VLOOKUP($M2,クラス能力値,4,0)","v":3},{"$f":"VLOOKUP($M2,クラス能力値,5,0)","v":4},{"$f":"VLOOKUP($M2,クラス能力値,6,0)","v":3},{"$f":"VLOOKUP($M2,クラス能力値,7,0)","v":3},null,null,null,"天",0,0,0,1,1,1,5,7,null,"アイドル",2,3,3,3,2,5,null,{"$f":"IF($BD$2=$BE$2,AG2,\"×\")","v":"アイドル"},0,1,1,0,1,0,2,3,2,1,null,{"$f":"IF(AO2=\"×\",\"\",AO2)","v":"アイドル"},null,"NW3基本",{"$f":"基本シート!AA3","v":122251},122251]
[1,null,null,null,null,null,null,null,null,null,null,null,{"$f":"基本シート!W5","v":"魔物使い"},{"$f":"VLOOKUP($M3,クラス能力値,2,0)","v":4},{"$f":"VLOOKUP($M3,クラス能力値,3,0)","v":3},{"$f":"VLOOKUP($M3,クラス能力値,4,0)","v":2},{"$f":"VLOOKUP($M3,クラス能力値,5,0)","v":3},{"$f":"VLOOKUP($M3,クラス能力値,6,0)","v":3},{"$f":"VLOOKUP($M3,クラス能力値,7,0)","v":3},null,null,null,"冥",0,0,1,1,1,0,4,8,null,"大いなる者",3,3,2,4,4,2,null,{"$f":"IF($BD$2=$BE$2,AG3,\"×\")","v":"大いなる者"},0,0,2,1,1,1,1,3,2,0,null,{"$f":"IF(AO3=\"×\",\"\",AO3)","v":"大いなる者"},null,"NW3上級",{"$f":"基本シート!AA4","v":"Iris118"},"Iris118"]
[2,null,null,null,null,null,null,null,null,null,null,null,{"$f":"基本シート!C6","v":"火"},{"$f":"VLOOKUP($M4,属性,2,0)","v":1},{"$f":"VLOOKUP($M4,属性,3,0)","v":1},{"$f":"VLOOKUP($M4,属性,4,0)","v":0},{"$f":"VLOOKUP($M4,属性,5,0)","v":0},{"$f":"VLOOKUP($M4,属性,6,0)","v":1},{"$f":"VLOOKUP($M4,属性,7,0)","v":0},{"$f":"VLOOKUP($M4,属性,8,0)","v":9},{"$f":"VLOOKUP($M4,属性,9,0)","v":3},null,"地",1,0,0,1,1,0,7,5,null,"落とし子",2,3,4,4,3,2,null,"落とし子",1,0,1,1,1,1,1,2,3,0,null,"落とし子"]
[3,null,null,null,null,null,null,null,null,null,null,null,{"$f":"基本シート!D6","v":"地"},{"$f":"VLOOKUP($M5,属性,2,0)","v":1},{"$f":"VLOOKUP($M5,属性,3,0)","v":0},{"$f":"VLOOKUP($M5,属性,4,0)","v":0},{"$f":"VLOOKUP($M5,属性,5,0)","v":1},{"$f":"VLOOKUP($M5,属性,6,0)","v":1},{"$f":"VLOOKUP($M5,属性,7,0)","v":0},{"$f":"VLOOKUP($M5,属性,8,0)","v":7},{"$f":"VLOOKUP($M5,属性,9,0)","v":5},null,"水",0,1,0,1,0,1,3,9,null,"陰陽師",2,3,2,4,4,3,null,"陰陽師",0,1,1,0,1,0,2,4,1,1,null,"陰陽師"]
[4,null,null,null,null,null,null,null,null,null,null,null,"初期選択",{"$f":"IF(基本シート!K6=\"筋力\",1,0)","v":1},{"$f":"IF(基本シート!K6=\"器用\",1,0)","v":0},{"$f":"IF(基本シート!K6=\"感覚\",1,0)","v":0},{"$f":"IF(基本シート!K6=\"理知\",1,0)","v":0},{"$f":"IF(基本シート!K6=\"意思\",1,0)","v":0},{"$f":"IF(基本シート!K6=\"幸運\",1,0)","v":0},null,null,null,"火",1,1,0,0,1,0,9,3,null,"吸血鬼",4,3,3,3,3,2,null,"吸血鬼",1,0,1,1,1,1,0,3,2,1,null,"吸血鬼"]
[5,null,null,null,null,null,null,null,null,null,null,null,"合計",{"$f":"SUM(N2:N6)","v":9},7,5,8,8,6,{"$f":"SUM(T4:T5,N7)","v":25},{"$f":"SUM(U4:U5,R7)","v":16},null,"風",0,1,1,0,0,1,8,4,null,"強化人間",3,4,4,3,2,2,null,"強化人間",2,1,0,2,0,1,0,4,1,0,null,"強化人間"]
[6,null,null,null,null,null,null,null,null,null,null,null,null,null,null,null,null,null,null,null,null,null,"虚",1,0,1,1,0,0,6,6,null,"人狼",5,3,4,2,2,2,null,"人狼",2,0,0,2,0,0,0,4,1,2,null,"人狼"]
[7,null,null,null,null,null,null,null,null,null,null,null,null,null,null,null,null,null,null,null,null,null,null,null,null,null,null,null,null,null,null,null,"聖職者",3,3,2,3,4,3,null,"聖職者",0,1,1,1,1,0,1,2,3,1,null,"聖職者"]
[8,"月衣","-","常時","自動","自身","なし","なし","なし","アイテムを隠す",null,null,null,null,null,null,null,null,null,null,null,null,null,null,null,null,null,null,null,null,null,null,"属性使い",2,3,5,2,3,3,null,"属性使い",1,1,1,1,1,0,0,2,3,1,null,"属性使い"]
[1,null,null,null,null,null,null,null,null,null,null,null,null,null,null,null,null,null,null,null,null,null,null,null,null,null,null,null,null,null,null,null,"電脳使い",2,3,3,3,4,3,null,"電脳使い",0,0,2,0,1,0,2,2,3,1,null,"電脳使い"]
[2,null,null,null,null,null,null,null,null,null,null,null,null,null,null,null,null,null,null,null,null,null,null,null,null,null,null,null,null,null,null,null,"忍者",4,4,4,2,2,2,null,"忍者",1,1,0,1,1,1,0,3,2,1,null,"忍者"]
[3,null,null,null,null,null,null,null,null,null,null,null,null,null,null,null,null,null,null,null,null,null,null,null,null,null,null,null,null,null,null,null,"魔鎧使い",4,3,3,2,3,3,null,"魔鎧使い",0,2,0,0,0,2,2,2,3,0,null,"魔鎧使い"]
[4,null,null,null,null,null,null,null,null,null,null,null,null,null,null,null,null,null,null,null,null,null,null,null,null,null,null,null,null,null,null,null,"魔剣使い",5,3,3,2,2,3,null,"魔剣使い",2,1,0,2,0,1,0,4,1,0,null,"魔剣使い"]
[5,null,null,null,null,null,null,null,null,null,null,null,null,null,null,null,null,null,null,null,null,null,null,null,null,null,null,null,null,null,null,null,"魔銃使い",3,4,4,2,2,3,null,"魔銃使い",2,0,0,2,0,1,1,2,3,0,null,"魔銃使い"]
{"$rows_left_out":18}
{"sheet":"バージョン情報","index":4,"n_rows":11,"n_cols":3,"rows_kept":11,"cut":false,"hidden":false,"merged":[[3,0,4,0],[3,1,4,1]]}
["バージョン","日付","内容"]
["Ver.1.00 ","2014-08-02","基本ルールブック発売に合わせて作成"]
["Ver.1.01","2014-08-07","ミスを修正"]
["Ver.1.02","2014-08-15","ルールブック単位でパスワードを設定。所持していないルールブックのデータは使用不能に"]
[null,null,"HP、MP計算を修正"]
["Ver.1.03","2014-08-23","重量超過を反映、ミスの修正"]
["Ver.1.04","2014-08-29","HP、MP計算を再修正"]
["Ver.1.05","2014-09-03","上級ルールブックのデータを反映"]
[]
[]
["製作：神行太保"]